BDBM50145637 CHEMBL3765301
SMILES Cc1ccn(n1)-c1cc(Cl)ccc1[C@@H](Oc1cc(nc(N)n1)N1CC2CCC(C1)N2C[C@H](N)C(O)=O)C(F)(F)F
InChI Key InChIKey=KAWWLWBAIXGBJM-YNILIBFXSA-N
Data  1 IC50
  Tab Delimited (TSV)   2D SDfile   Computed 3D by Vconf -m prep SDfile
Find this compound or compounds like it in BindingDB:
Activity Spreadsheet -- Enzyme Inhibition Constant Data from BindingDB
Found 1 hit for monomerid = 50145637
TargetTryptophan 5-hydroxylase 1(Homo sapiens (Human))
Karos Pharmaceuticals
Curated by ChEMBL
LigandPNGBDBM50145637(CHEMBL3765301)
Affinity DataIC50:  96nM. Assay description: Inhibition of TPH1 (unknown origin)
In DepthDetails ArticlePubMed