BDBM50147116 CHEMBL105536::Ethyl-(2-hydroxy-ethyl)-dimethyl-ammonium
SMILES CC[N+](C)(C)CCO
InChI Key InChIKey=VKHSBLZDXXEWNM-UHFFFAOYSA-N
Data  1 KI
  Tab Delimited (TSV)   2D SDfile   Computed 3D by Vconf -m prep SDfile
Find this compound or compounds like it in BindingDB:
Activity Spreadsheet -- Enzyme Inhibition Constant Data from BindingDB
Found 1 hit for monomerid = 50147116
TargetSodium- and chloride-dependent creatine transporter 1(Rattus norvegicus)
Texas Tech University Health Sciences Center
Curated by ChEMBL
LigandPNGBDBM50147116(CHEMBL105536 | Ethyl-(2-hydroxy-ethyl)-dimethyl-am...)
Affinity DataKi:  9.40E+4nM. Assay description: Inhibition of [3H]-choline brain uptake was determined by in situ brain perfusion studies in male rats
In DepthDetails ArticlePubMed