BDBM50148591 2-(1,3-dioxo-1,3-dihydro-2H-isoindol-2-yl)-ethyl ethylbutylphosphonate::Butyl-phosphonic acid 2-(1,3-dioxo-1,3-dihydro-isoindol-2-yl)-ethyl ester ethyl ester::CHEMBL333999
SMILES CCCCP(=O)(OCC)OCCN1C(=O)c2ccccc2C1=O
InChI Key InChIKey=KBYFBJGWMSREFL-UHFFFAOYSA-N
Data  2 IC50
  Tab Delimited (TSV)   2D SDfile   Computed 3D by Vconf -m prep SDfile
Find this compound or compounds like it in BindingDB:
Activity Spreadsheet -- Enzyme Inhibition Constant Data from BindingDB
Found 2 hits for monomerid = 50148591
TargetDiacylglycerol acyltransferase/mycolyltransferase Ag85C(Mycobacterium tuberculosis)
University Of Ljubljana
Curated by ChEMBL
LigandPNGBDBM50148591(2-(1,3-dioxo-1,3-dihydro-2H-isoindol-2-yl)-ethyl e...)
Affinity DataIC50:  5.07E+4nM. Assay description: Inhibition of Mycobacterium tuberculosis recombinant antigen 85C mycolyltransferase
In DepthDetails ArticlePubMed
TargetDiacylglycerol acyltransferase/mycolyltransferase Ag85C(Mycobacterium tuberculosis)
University Of Ljubljana
Curated by ChEMBL
LigandPNGBDBM50148591(2-(1,3-dioxo-1,3-dihydro-2H-isoindol-2-yl)-ethyl e...)
Affinity DataIC50:  5.07E+4nM. Assay description: In vitro concentration required to inhibit antigen 85C mycolyltransferase activity in Mycobaterium tuberculosis
In DepthDetails ArticlePubMed