BDBM50149222 9-Ethyl-9H-carbazole-3-carbaldehyde O-{2-[1-(3,4-dihydroxy-phenyl)-meth-(E)-ylideneaminooxy]-ethyl}-oxime::CHEMBL119620
SMILES CCn1c2ccccc2c2cc(\C=N/OCCO\N=C\c3ccc(O)c(O)c3)ccc12
InChI Key InChIKey=OOOXOSSUALIGRD-WFOJNGAISA-N
Data  1 IC50
  Tab Delimited (TSV)   2D SDfile   Computed 3D by Vconf -m prep SDfile
Find this compound or compounds like it in BindingDB:
Activity Spreadsheet -- Enzyme Inhibition Constant Data from BindingDB
Found 1 hit for monomerid = 50149222
TargetProto-oncogene tyrosine-protein kinase Src(Homo sapiens (Human))
Sunesis Pharmaceuticals
Curated by ChEMBL
LigandPNGBDBM50149222(9-Ethyl-9H-carbazole-3-carbaldehyde O-{2-[1-(3,4-d...)
Affinity DataIC50:  64nM. Assay description: Inhibition of c-Src tyrosine kinase
In DepthDetails ArticlePubMed