BDBM50149349 1-Cyclopropylmethyl-5-isobutyl-1H-imidazole::CHEMBL333092
SMILES CC(C)Cc1cncn1CC1CC1
InChI Key InChIKey=KGUCLLVDDSQJTC-UHFFFAOYSA-N
Data  1 IC50
  Tab Delimited (TSV)   2D SDfile   Computed 3D by Vconf -m prep SDfile
Find this compound or compounds like it in BindingDB:
Activity Spreadsheet -- Enzyme Inhibition Constant Data from BindingDB
Found 1 hit for monomerid = 50149349
TargetCamphor 5-monooxygenase(Pseudomonas putida)
University Of California
Curated by ChEMBL
LigandPNGBDBM50149349(1-Cyclopropylmethyl-5-isobutyl-1H-imidazole | CHEM...)
Affinity DataIC50:  1.01E+4nM. Assay description: Inhibition of L244A mutant cytochrome P450cam expressed in Escherichia coli
In DepthDetails ArticlePubMed