BDBM501495 5-(2-ethoxy-3-pyridyl)-N-[(5-methoxy-3- pyridyl)methyl]-3-methyl-[1- methylpropyl]pyrazolo[4,3-b]pyridin-7-amine, enantiomer 2::US11026923, Example 125
SMILES CCOc1ncccc1-c1cc(NCc2cncc(OC)c2)c(NC(C)CC)c(n1)C(C)=N
InChI Key InChIKey=FIZYUMZEYFRNCJ-UHFFFAOYSA-N
Data  3 IC50
  Tab Delimited (TSV)   2D SDfile   Computed 3D by Vconf -m prep SDfile
Find this compound or compounds like it in BindingDB:
Activity Spreadsheet -- Enzyme Inhibition Constant Data from BindingDB
Found 3 hits for monomerid = 501495
LigandPNGBDBM501495(5-(2-ethoxy-3-pyridyl)-N-[(5-methoxy-3- pyridyl)me...)
Affinity DataIC50:  1nM. Assay description: PDE1A, PDE1B and PDE1C assays were performed as follows: the assays was performed in 60 uL samples containing a fixed amount of the PDE1 enzyme (suff...
Ligand InfoPC cidPC sid
In DepthDetails US Patent
LigandPNGBDBM501495(5-(2-ethoxy-3-pyridyl)-N-[(5-methoxy-3- pyridyl)me...)
Affinity DataIC50:  4.30nM. Assay description: PDE1A, PDE1B and PDE1C assays were performed as follows: the assays was performed in 60 uL samples containing a fixed amount of the PDE1 enzyme (suff...
Ligand InfoPC cidPC sid
In DepthDetails US Patent
LigandPNGBDBM501495(5-(2-ethoxy-3-pyridyl)-N-[(5-methoxy-3- pyridyl)me...)
Affinity DataIC50:  0.320nM. Assay description: PDE1A, PDE1B and PDE1C assays were performed as follows: the assays was performed in 60 uL samples containing a fixed amount of the PDE1 enzyme (suff...
Ligand InfoPC cidPC sid
In DepthDetails US Patent