BDBM50149857 CHEMBL181745::{4-[2-(4-Acetylamino-phenylsulfanyl)-phenyl]-2,5-dimethyl-piperazin-1-yl}-acetic acid
SMILES CC1CN(C(C)CN1CC(O)=O)c1ccccc1Sc1ccc(NC(C)=O)cc1
InChI Key InChIKey=IJOSWIDZDBURQU-UHFFFAOYSA-N
Data  1 IC50
  Tab Delimited (TSV)   2D SDfile   Computed 3D by Vconf -m prep SDfile
Find this compound or compounds like it in BindingDB:
Activity Spreadsheet -- Enzyme Inhibition Constant Data from BindingDB
Found 1 hit for monomerid = 50149857
TargetSodium- and chloride-dependent glycine transporter 1(Homo sapiens (Human))
H. Lundbeck
Curated by ChEMBL
LigandPNGBDBM50149857(CHEMBL181745 | {4-[2-(4-Acetylamino-phenylsulfanyl...)
Affinity DataIC50:  2.20E+4nM. Assay description: Inhibition of uptake of [3H]-glycine into cells transfected with human GlyT-1b transporterChecked by Author
In DepthDetails ArticlePubMed