BDBM50151478 (1R,2R,3R,5R,6R)-2-Amino-3-[bis-(3,4-dichloro-phenyl)-methoxy]-6-fluoro-bicyclo[3.1.0]hexane-2,6-dicarboxylic acid::CHEMBL363724
SMILES N[C@@]1([C@H]2[C@@H](C[C@H]1OC(c1ccc(Cl)c(Cl)c1)c1ccc(Cl)c(Cl)c1)[C@]2(F)C(O)=O)C(O)=O
InChI Key InChIKey=MWMRGOAQZKYVHH-DKRZJBNNSA-N
Data  1 KI
  Tab Delimited (TSV)   2D SDfile   Computed 3D by Vconf -m prep SDfile
Find this compound or compounds like it in BindingDB:
Activity Spreadsheet -- Enzyme Inhibition Constant Data from BindingDB
Found 1 hit for monomerid = 50151478
TargetMetabotropic glutamate receptor 2(Homo sapiens (Human))
Taisho Pharmaceutical
Curated by ChEMBL
LigandPNGBDBM50151478((1R,2R,3R,5R,6R)-2-Amino-3-[bis-(3,4-dichloro-phen...)
Affinity DataKi:  2.61nM. Assay description: Binding affinity towards metabotropic glutamate receptor 2 of rat expressed in CHO cells was determined by using [3H]-MGS0008
In DepthDetails ArticlePubMed