BDBM50152264 (S)-2-{(S)-2-[(S)-3-(4-Chloro-phenyl)-2-(3-methyl-ureido)-propionylamino]-3-phenyl-propionylamino}-5-guanidino-pentanoic acid [(S)-1-carbamoyl-2-(1H-indol-3-yl)-ethyl]-amide::CHEMBL181161
SMILES CNC(=O)N[C@@H](Cc1ccc(Cl)cc1)C(=O)N[C@@H](Cc1ccccc1)C(=O)N[C@@H](CCCNC(N)=N)C(=O)N[C@@H](Cc1c[nH]c2ccccc12)C(N)=O
InChI Key InChIKey=ACTPUDHTSAXOLZ-ORYMTKCHSA-N
Data  3 EC50
  Tab Delimited (TSV)   2D SDfile   Computed 3D by Vconf -m prep SDfile
Find this compound or compounds like it in BindingDB:
Activity Spreadsheet -- Enzyme Inhibition Constant Data from BindingDB
Found 3 hits for monomerid = 50152264
TargetMelanocortin receptor 3(Homo sapiens (Human))
University Of Cincinnati
Curated by ChEMBL
LigandPNGBDBM50152264((S)-2-{(S)-2-[(S)-3-(4-Chloro-phenyl)-2-(3-methyl-...)
Affinity DataEC50:  87nM. Assay description: Agonistic activity against against human Melanocortin 3 receptor
In DepthDetails ArticlePubMed
TargetMelanocyte-stimulating hormone receptor(Homo sapiens (Human))
University Of Cincinnati
Curated by ChEMBL
LigandPNGBDBM50152264((S)-2-{(S)-2-[(S)-3-(4-Chloro-phenyl)-2-(3-methyl-...)
Affinity DataEC50:  848nM. Assay description: Agonistic activity against against human Melanocortin 1 receptor
In DepthDetails ArticlePubMed
TargetMelanocortin receptor 4(Homo sapiens (Human))
University Of Cincinnati
Curated by ChEMBL
LigandPNGBDBM50152264((S)-2-{(S)-2-[(S)-3-(4-Chloro-phenyl)-2-(3-methyl-...)
Affinity DataEC50:  8.5nM. Assay description: Agonistic activity against against human Melanocortin 4 receptor
In DepthDetails ArticlePubMed