BDBM50152265 (S)-2-{(S)-2-[(S)-3-(4-Chloro-phenyl)-2-(2-formylamino-acetylamino)-propionylamino]-3-phenyl-propionylamino}-5-guanidino-pentanoic acid [(S)-1-carbamoyl-2-(1H-indol-3-yl)-ethyl]-amide::CHEMBL369770
SMILES NC(=N)NCCC[C@H](NC(=O)[C@H](Cc1ccccc1)NC(=O)[C@H](Cc1ccc(Cl)cc1)NC(=O)CNC=O)C(=O)N[C@@H](Cc1c[nH]c2ccccc12)C(N)=O
InChI Key InChIKey=UHBVZDUIWRPWFM-YDPTYEFTSA-N
Data  3 EC50
  Tab Delimited (TSV)   2D SDfile   Computed 3D by Vconf -m prep SDfile
Find this compound or compounds like it in BindingDB:
Activity Spreadsheet -- Enzyme Inhibition Constant Data from BindingDB
Found 3 hits for monomerid = 50152265
TargetMelanocortin receptor 3(Homo sapiens (Human))
University Of Cincinnati
Curated by ChEMBL
LigandPNGBDBM50152265((S)-2-{(S)-2-[(S)-3-(4-Chloro-phenyl)-2-(2-formyla...)
Affinity DataEC50:  757nM. Assay description: Agonistic activity against against human Melanocortin 3 receptor
In DepthDetails ArticlePubMed
TargetMelanocyte-stimulating hormone receptor(Homo sapiens (Human))
University Of Cincinnati
Curated by ChEMBL
LigandPNGBDBM50152265((S)-2-{(S)-2-[(S)-3-(4-Chloro-phenyl)-2-(2-formyla...)
Affinity DataEC50:  600nM. Assay description: Agonistic activity against against human Melanocortin 1 receptor
In DepthDetails ArticlePubMed
TargetMelanocortin receptor 4(Homo sapiens (Human))
University Of Cincinnati
Curated by ChEMBL
LigandPNGBDBM50152265((S)-2-{(S)-2-[(S)-3-(4-Chloro-phenyl)-2-(2-formyla...)
Affinity DataEC50:  14nM. Assay description: Agonistic activity against against human Melanocortin 4 receptor
In DepthDetails ArticlePubMed