BDBM50152267 2-((S)-2-{(S)-3-(4-Chloro-phenyl)-2-[4-(3,5-difluoro-phenyl)-4-oxo-butyrylamino]-1-oxo-propylamino}-3-phenyl-propionylamino)-5-guanidino-pentanoic acid [(S)-1-carbamoyl-2-(1H-indol-3-yl)-ethyl]-amide::CHEMBL363271
SMILES NC(=N)NCCC[C@H](NC(=O)[C@H](Cc1ccccc1)NC(=O)[C@H](Cc1ccc(Cl)cc1)NC(=O)CCC(=O)c1cc(F)cc(F)c1)C(=O)N[C@@H](Cc1c[nH]c2ccccc12)C(N)=O
InChI Key InChIKey=JMYFAHGOQLWURN-ZQWQDMLBSA-N
Data  3 EC50
  Tab Delimited (TSV)   2D SDfile   Computed 3D by Vconf -m prep SDfile
Find this compound or compounds like it in BindingDB:
Activity Spreadsheet -- Enzyme Inhibition Constant Data from BindingDB
Found 3 hits for monomerid = 50152267
TargetMelanocortin receptor 3(Homo sapiens (Human))
University Of Cincinnati
Curated by ChEMBL
LigandPNGBDBM50152267(2-((S)-2-{(S)-3-(4-Chloro-phenyl)-2-[4-(3,5-difluo...)
Affinity DataEC50:  140nM. Assay description: Agonistic activity against against human Melanocortin 3 receptor
In DepthDetails ArticlePubMed
TargetMelanocyte-stimulating hormone receptor(Homo sapiens (Human))
University Of Cincinnati
Curated by ChEMBL
LigandPNGBDBM50152267(2-((S)-2-{(S)-3-(4-Chloro-phenyl)-2-[4-(3,5-difluo...)
Affinity DataEC50:  41nM. Assay description: Agonistic activity against against human Melanocortin 1 receptor
In DepthDetails ArticlePubMed
TargetMelanocortin receptor 4(Homo sapiens (Human))
University Of Cincinnati
Curated by ChEMBL
LigandPNGBDBM50152267(2-((S)-2-{(S)-3-(4-Chloro-phenyl)-2-[4-(3,5-difluo...)
Affinity DataEC50:  96nM. Assay description: Agonistic activity against against human Melanocortin 4 receptor
In DepthDetails ArticlePubMed