BDBM50153001 CHEMBL3781742
SMILES COC(=O)Nc1ccc(cc1)-c1cc([nH]c(=O)c1)[C@H](Cc1ccccc1)NC(=O)\C=C\c1cc(Cl)ccc1-n1cnnn1
InChI Key InChIKey=YNNDJMAFZOKCGL-BULTVDLSSA-N
Data  1 KI
  Tab Delimited (TSV)   2D SDfile   Computed 3D by Vconf -m prep SDfile
Find this compound or compounds like it in BindingDB:
Activity Spreadsheet -- Enzyme Inhibition Constant Data from BindingDB
Found 1 hit for monomerid = 50153001
TargetCoagulation factor XI(Homo sapiens (Human))
Bristol-Myers Squibb
Curated by ChEMBL
LigandPNGBDBM50153001(CHEMBL3781742)
Affinity DataKi:  2.40nM. Assay description: Competitive inhibition of human coagulation factor 11a assessed as reduction in release of p-nitroaniline after 10 to 120 mins by Michaelis-Menten eq...
In DepthDetails ArticlePubMed