BDBM50153712 1-deoxy-L-ribulose 5-phosphate
SMILES CC(=O)[C@@H](O)[C@@H](O)COP([O-])([O-])=O
InChI Key InChIKey=AJPADPZSRRUGHI-CRCLSJGQSA-L
Data  1 KI
  Tab Delimited (TSV)   2D SDfile   Computed 3D by Vconf -m prep SDfile
Find this compound or compounds like it in BindingDB:
Activity Spreadsheet -- Enzyme Inhibition Constant Data from BindingDB
Found 1 hit for monomerid = 50153712
Target1-deoxy-D-xylulose 5-phosphate reductoisomerase(Synechocystis sp. (strain PCC 6803))
Oregon State University
Curated by ChEMBL
LigandPNGBDBM50153712(1-deoxy-L-ribulose 5-phosphate)
Affinity DataKi:  1.80E+5nM. Assay description: Binding affinity against Synechocystis strain PCC6803 DXP reductoisomerase
In DepthDetails ArticlePubMed