BDBM50153826 3-(4-benzyloxyphenylcarboxamido)-4-methyl-1-[3-(1,4-oxazinan-4-yl)phenylcarboxamido]benzene::CHEMBL365929
SMILES Cc1ccc(NC(=O)c2cccc(c2)N2CCOCC2)cc1NC(=O)c1ccc(OCc2ccccc2)cc1
InChI Key InChIKey=VCCDQSPTHMYMNR-UHFFFAOYSA-N
Data  1 IC50
  Tab Delimited (TSV)   2D SDfile   Computed 3D by Vconf -m prep SDfile
Find this compound or compounds like it in BindingDB:
Activity Spreadsheet -- Enzyme Inhibition Constant Data from BindingDB
Found 1 hit for monomerid = 50153826
TargetMitogen-activated protein kinase 14(Homo sapiens (Human))
Astrazeneca
Curated by ChEMBL
LigandPNGBDBM50153826(3-(4-benzyloxyphenylcarboxamido)-4-methyl-1-[3-(1,...)
Affinity DataIC50:  30nM. Assay description: Concentration required to inhibit human mitogen activated protein kinase p38 activity
In DepthDetails ArticlePubMed