BDBM50153865 CHEMBL184271::N-{3-[7-Methoxy-6-(2-morpholin-4-yl-ethoxy)-quinazolin-4-ylamino]-4-methyl-phenyl}-2-morpholin-4-yl-isonicotinamide
SMILES COc1cc2ncnc(Nc3cc(NC(=O)c4ccnc(c4)N4CCOCC4)ccc3C)c2cc1OCCN1CCOCC1
InChI Key InChIKey=PCKQYQGEALHHPW-UHFFFAOYSA-N
Data  1 IC50
  Tab Delimited (TSV)   2D SDfile   Computed 3D by Vconf -m prep SDfile
Find this compound or compounds like it in BindingDB:
Activity Spreadsheet -- Enzyme Inhibition Constant Data from BindingDB
Found 1 hit for monomerid = 50153865
TargetMitogen-activated protein kinase 14(Homo sapiens (Human))
Astrazeneca
Curated by ChEMBL
LigandPNGBDBM50153865(CHEMBL184271 | N-{3-[7-Methoxy-6-(2-morpholin-4-yl...)
Affinity DataIC50:  20nM. Assay description: Inhibitory concentration against alpha mitogen activated protein kinase p38 activity
In DepthDetails ArticlePubMed