BDBM50155413 4-Hydroxy-xanthen-9-one::CHEMBL359978
SMILES Oc1cccc2c1oc1ccccc1c2=O
InChI Key InChIKey=KBQFPPUAIJHDCO-UHFFFAOYSA-N
Data  2 IC50
  Tab Delimited (TSV)   2D SDfile   Computed 3D by Vconf -m prep SDfile
Find this compound or compounds like it in BindingDB:
Activity Spreadsheet -- Enzyme Inhibition Constant Data from BindingDB
Found 2 hits for monomerid = 50155413
TargetTyrosinase(Homo sapiens (Human))
Universidade Dos A£Ores
Curated by ChEMBL
LigandPNGBDBM50155413(4-Hydroxy-xanthen-9-one | CHEMBL359978)
Affinity DataIC50:  8.46E+3nM. Assay description: Inhibition of Tyrosinase (unknown origin) using tyrosine as substrate incubated for 20 mins followed by substrate addition and measured every 10 mins...
In DepthDetails ArticlePubMed
TargetAmine oxidase [flavin-containing] A(Homo sapiens (Human))
Unne
Curated by ChEMBL
LigandPNGBDBM50155413(4-Hydroxy-xanthen-9-one | CHEMBL359978)
Affinity DataIC50:  1.30E+3nM. Assay description: Concentration required to inhibit monoamine oxidase activity by 50%
In DepthDetails ArticlePubMed