BDBM50155462 (1S,2R,5S)-5-(6-Amino-purin-9-yl)-4-fluoro-3-fluoromethyl-cyclopent-3-ene-1,2-diol::CHEMBL363897
SMILES Nc1ncnc2n(cnc12)[C@H]1[C@H](O)[C@H](O)C(CF)=C1F
InChI Key InChIKey=XNMDLRLZAAFDQA-HLTSFMKQSA-N
Data  1 IC50
  Tab Delimited (TSV)   2D SDfile   Computed 3D by Vconf -m prep SDfile
Find this compound or compounds like it in BindingDB:
Activity Spreadsheet -- Enzyme Inhibition Constant Data from BindingDB
Found 1 hit for monomerid = 50155462
TargetAdenosylhomocysteinase(Homo sapiens (Human))
Pusan National University
Curated by ChEMBL
LigandPNGBDBM50155462((1S,2R,5S)-5-(6-Amino-purin-9-yl)-4-fluoro-3-fluor...)
Affinity DataIC50: >1.00E+5nM. Assay description: Inhibitory activity against enzyme S-adenosylhomocysteine hydrolase of human placenta
In DepthDetails ArticlePubMed