BDBM50155539 5-(4-Isothiocyanato-benzenesulfonylamino)-[1,3,4]thiadiazole-2-sulfonic acid amide::CHEMBL187034
SMILES NS(=O)(=O)c1nnc(NS(=O)(=O)c2ccc(cc2)N=C=S)s1
InChI Key InChIKey=BHGXZDRFYWOZFO-UHFFFAOYSA-N
Data  3 KI
  Tab Delimited (TSV)   2D SDfile   Computed 3D by Vconf -m prep SDfile
Find this compound or compounds like it in BindingDB:
Activity Spreadsheet -- Enzyme Inhibition Constant Data from BindingDB
Found 3 hits for monomerid = 50155539
TargetCarbonic anhydrase 2(Homo sapiens (Human))
Universit£
Curated by ChEMBL
LigandPNGBDBM50155539(5-(4-Isothiocyanato-benzenesulfonylamino)-[1,3,4]t...)
Affinity DataKi:  1.70nM. Assay description: Binding affinity towards human cloned carbonic anhydrase II
In DepthDetails ArticlePubMed
TargetCarbonic anhydrase 1(Homo sapiens (Human))
Universit£
Curated by ChEMBL
LigandPNGBDBM50155539(5-(4-Isothiocyanato-benzenesulfonylamino)-[1,3,4]t...)
Affinity DataKi:  15nM. Assay description: Binding affinity towards human cloned carbonic anhydrase I
In DepthDetails ArticlePubMed
TargetCarbonic anhydrase 9(Homo sapiens (Human))
Universit£
Curated by ChEMBL
LigandPNGBDBM50155539(5-(4-Isothiocyanato-benzenesulfonylamino)-[1,3,4]t...)
Affinity DataKi:  23nM. Assay description: Binding affinity towards human cloned carbonic anhydrase IX
In DepthDetails ArticlePubMed