BDBM50155549 2-Butyl-hexanoic acid (5-sulfamoyl-indan-2-yl)-amide::CHEMBL185041
SMILES CCCCC(CCCC)C(=O)NC1Cc2ccc(cc2C1)S(N)(=O)=O
InChI Key InChIKey=PZMNZELZNFVQAV-UHFFFAOYSA-N
Data  2 KI
  Tab Delimited (TSV)   2D SDfile   Computed 3D by Vconf -m prep SDfile
Find this compound or compounds like it in BindingDB:
Activity Spreadsheet -- Enzyme Inhibition Constant Data from BindingDB
Found 2 hits for monomerid = 50155549
TargetCarbonic anhydrase 1(Homo sapiens (Human))
Universit£
Curated by ChEMBL
LigandPNGBDBM50155549(2-Butyl-hexanoic acid (5-sulfamoyl-indan-2-yl)-ami...)
Affinity DataKi:  1.60nM. Assay description: Binding affinity towards human cloned carbonic anhydrase I
In DepthDetails ArticlePubMed
TargetCarbonic anhydrase 2(Homo sapiens (Human))
Universit£
Curated by ChEMBL
LigandPNGBDBM50155549(2-Butyl-hexanoic acid (5-sulfamoyl-indan-2-yl)-ami...)
Affinity DataKi:  3.40nM. Assay description: Binding affinity towards human cloned carbonic anhydrase II
In DepthDetails ArticlePubMed