BDBM50155595 4-Dimethylamino-2-methoxy-6-{[2-(4-nitro-phenyl)-ethylamino]-methyl}-phenol::CHEMBL186644
SMILES COc1cc(cc(CNCCc2ccc(cc2)[N+]([O-])=O)c1O)N(C)C
InChI Key InChIKey=PBKWFQXZOSIIAD-UHFFFAOYSA-N
Data  1 IC50
  Tab Delimited (TSV)   2D SDfile   Computed 3D by Vconf -m prep SDfile
Find this compound or compounds like it in BindingDB:
Activity Spreadsheet -- Enzyme Inhibition Constant Data from BindingDB
Found 1 hit for monomerid = 50155595
TargetM-phase inducer phosphatase 3(Homo sapiens (Human))
Institut Henri Beaufour
Curated by ChEMBL
LigandPNGBDBM50155595(4-Dimethylamino-2-methoxy-6-{[2-(4-nitro-phenyl)-e...)
Affinity DataIC50:  4.00E+3nM. Assay description: Inhibitory concentration for human cell division cycle 25 degree C phosphatase
In DepthDetails ArticlePubMed