BDBM50155885 CHEMBL3780093
SMILES CCNS(=O)(=O)c1ccc2N(CC)C(=O)c3cccc1c23
InChI Key InChIKey=AQNBGQLJCYVCBR-UHFFFAOYSA-N
Data  1 IC50
PDB links: 1 PDB ID matches this monomer.
  Tab Delimited (TSV)   2D SDfile   Computed 3D by Vconf -m prep SDfile
Find this compound or compounds like it in BindingDB:
Activity Spreadsheet -- Enzyme Inhibition Constant Data from BindingDB
Found 1 hit for monomerid = 50155885
TargetBromodomain-containing protein 4(Homo sapiens (Human))
Guangzhou Institutes Of Biomedicine And Health
Curated by ChEMBL
LigandPNGBDBM50155885(CHEMBL3780093)
Affinity DataIC50:  1.09E+3nM. Assay description: Inhibition of human His6-tagged BRD4 bromodomain 1 (N44 to E168 residues) expressed in Escherichia coli BL21(DE3) cells using biotin-H4KAc4 as substr...