BDBM50158613 CHEMBL3786638
SMILES COc1cc2c3n([C@H](C)c4ccccn4)\c(=N\C#N)[nH]c3cnc2cc1-c1c(C)noc1C
InChI Key InChIKey=PJSVTZAEFUMJQI-CQSZACIVSA-N
Data  1 IC50
  Tab Delimited (TSV)   2D SDfile   Computed 3D by Vconf -m prep SDfile
Find this compound or compounds like it in BindingDB:
Activity Spreadsheet -- Enzyme Inhibition Constant Data from BindingDB
Found 1 hit for monomerid = 50158613
TargetBromodomain-containing protein 4(Homo sapiens (Human))
Genentech
Curated by ChEMBL
LigandPNGBDBM50158613(CHEMBL3786638)
Affinity DataIC50: <300nM. Assay description: Displacement of biotinylated tetra-acetylated histone H4 from human his-tagged BRD4 bromodomain1 europium chelate preincubated for 15 mins followed b...
In DepthDetails ArticlePubMed