BDBM50159226 CHEMBL3786376
SMILES OC(=O)C(F)(F)F.OC(=O)C(F)(F)F.CCC(=O)NCCCCNC(=O)\N=C(\N)NCCC[C@H](NC(=O)[C@H](CCC(N)=O)NC(=O)[C@@H]1CCCN1C(=O)[C@H](C)NC(=O)[C@H](C)NC(=O)[C@H](CC(C)C)NC(=O)[C@H](CO)NC(=O)[C@H](Cc1c[nH]c2ccccc12)NC(=O)[C@H](Cc1ccc(O)cc1)NC(=O)[C@@H](N)CCC(O)=O)C(=O)N[C@@H](Cc1ccccc1)C(N)=O
InChI Key InChIKey=XNUKDCGUQDKTQA-MPZHAKQISA-N
Data  1 KI
  Tab Delimited (TSV)   2D SDfile   Computed 3D by Vconf -m prep SDfile
Find this compound or compounds like it in BindingDB:
Activity Spreadsheet -- Enzyme Inhibition Constant Data from BindingDB
Found 1 hit for monomerid = 50159226
TargetNeuropeptide FF receptor 2(Homo sapiens (Human))
University Of Regensburg
Curated by ChEMBL
LigandPNGBDBM50159226(CHEMBL3786376)
Affinity DataKi:  41nM. Assay description: Displacement of [3H]EYE from human NPFF2 receptor expressed in CHO cell membranes after 1 hr by liquid scintillation spectrophotometric counting
In DepthDetails ArticlePubMed