BDBM501596 US11026958, Example A7
SMILES CC(C)c1cccnc1C1CC1c1ccc(cc1)S(N)(=O)=O
InChI Key InChIKey=HFYKBHHKCDPPOH-UHFFFAOYSA-N
Data  1 EC50
  Tab Delimited (TSV)   2D SDfile   Computed 3D by Vconf -m prep SDfile
Find this compound or compounds like it in BindingDB:
Activity Spreadsheet -- Enzyme Inhibition Constant Data from BindingDB
Found 1 hit for monomerid = 501596
TargetNeuronal acetylcholine receptor subunit alpha-7(Homo sapiens (Human))
Merck Sharp & Dohme
US Patent
LigandPNGBDBM501596(US11026958, Example A7)
Affinity DataEC50:  2.40E+3nM. Assay description: Test compounds were serially diluted in DMSO and then resuspended to the final test concentration in external recording solution, with, or without 40...
Ligand InfoPC cidPC sid
In DepthDetails US Patent