BDBM50160150 (S)-2-(2-Amino-ethoxymethyl)-6-ethyl-4-(4-nitro-phenyl)-1,4-dihydro-pyridine-3,5-dicarboxylic acid 5-amide 3-{[3-(4,4-diphenyl-piperidin-1-yl)-propyl]-amide}::CHEMBL180932
SMILES CCC1=NC(COCCN)=C([C@H](C1C(N)=O)c1ccc(cc1)[N+]([O-])=O)C(=O)NCCCN1CCC(CC1)(c1ccccc1)c1ccccc1
InChI Key InChIKey=XIIKDAODIFECTH-CDRRMRQFSA-N
Data  1 KI
  Tab Delimited (TSV)   2D SDfile   Computed 3D by Vconf -m prep SDfile
Find this compound or compounds like it in BindingDB:
Activity Spreadsheet -- Enzyme Inhibition Constant Data from BindingDB
Found 1 hit for monomerid = 50160150
TargetAlpha-1A adrenergic receptor(Homo sapiens (Human))
China Pharmaceutical University
Curated by ChEMBL
LigandPNGBDBM50160150((S)-2-(2-Amino-ethoxymethyl)-6-ethyl-4-(4-nitro-ph...)
Affinity DataKi:  0.400nM. Assay description: Binding constant measured against Alpha-1A adrenergic receptor in human prostate; +++:highly active
In DepthDetails ArticlePubMed