BDBM50160153 6-{3-[4-(2-Hydroxymethyl-2,3-dihydro-benzo[1,4]dioxin-6-yl)-piperazin-1-yl]-propylamino}-1,3-dimethyl-1H-pyrimidine-2,4-dione::CHEMBL181475
SMILES Cn1c(NCCCN2CCN(CC2)c2ccc3OC(CO)COc3c2)cc(=O)n(C)c1=O
InChI Key InChIKey=QTSKCJCWZQXFMQ-UHFFFAOYSA-N
Data  1 KI
  Tab Delimited (TSV)   2D SDfile   Computed 3D by Vconf -m prep SDfile
Find this compound or compounds like it in BindingDB:
Activity Spreadsheet -- Enzyme Inhibition Constant Data from BindingDB
Found 1 hit for monomerid = 50160153
TargetAlpha-1A adrenergic receptor(Homo sapiens (Human))
China Pharmaceutical University
Curated by ChEMBL
LigandPNGBDBM50160153(6-{3-[4-(2-Hydroxymethyl-2,3-dihydro-benzo[1,4]dio...)
Affinity DataKi:  20nM. Assay description: Binding constant measured against Alpha-1A adrenergic receptor in human prostate; ++:moderately active
In DepthDetails ArticlePubMed