BDBM50161595 4-((1R,2R,5R)-5-Hydroxymethyl-8-methyl-3-oxa-bicyclo[3.3.1]non-7-en-2-yl)-benzene-1,2-diol::CHEMBL179328
SMILES CC1=CC[C@@]2(CO)CO[C@H]([C@@H]1C2)c1ccc(O)c(O)c1
InChI Key InChIKey=HQDMLAXQJXSXAF-FFPFEORLSA-N
Data  2 EC50
  Tab Delimited (TSV)   2D SDfile   Computed 3D by Vconf -m prep SDfile
Find this compound or compounds like it in BindingDB:
Activity Spreadsheet -- Enzyme Inhibition Constant Data from BindingDB
Found 2 hits for monomerid = 50161595
TargetEstrogen receptor beta(Homo sapiens (Human))
Ligand Pharmaceuticals
Curated by ChEMBL
LigandPNGBDBM50161595(4-((1R,2R,5R)-5-Hydroxymethyl-8-methyl-3-oxa-bicyc...)
Affinity DataEC50:  3.16E+3nM. Assay description: In vitro agonist activity for estrogen receptor beta expressed in COS-1 cells
In DepthDetails ArticlePubMed
TargetEstrogen receptor(Homo sapiens (Human))
Ligand Pharmaceuticals
Curated by ChEMBL
LigandPNGBDBM50161595(4-((1R,2R,5R)-5-Hydroxymethyl-8-methyl-3-oxa-bicyc...)
Affinity DataEC50:  2.41E+3nM. Assay description: In vitro agonist activity for estrogen receptor alpha expressed in COS-1 cells
In DepthDetails ArticlePubMed