BDBM50162163 1-(3,5-Difluoro-phenyl)-3-[4-(6,7-dimethoxy-quinolin-4-yloxy)-phenyl]-urea::CHEMBL179816
SMILES COc1cc2nccc(Oc3ccc(NC(=O)Nc4cc(F)cc(F)c4)cc3)c2cc1OC
InChI Key InChIKey=WUEVFQBRVSPKLA-UHFFFAOYSA-N
Data  2 IC50
  Tab Delimited (TSV)   2D SDfile   Computed 3D by Vconf -m prep SDfile
Find this compound or compounds like it in BindingDB:
Activity Spreadsheet -- Enzyme Inhibition Constant Data from BindingDB
Found 2 hits for monomerid = 50162163
TargetPlatelet-derived growth factor receptor alpha(Homo sapiens (Human))
Kirin Brewery
Curated by ChEMBL
LigandPNGBDBM50162163(1-(3,5-Difluoro-phenyl)-3-[4-(6,7-dimethoxy-quinol...)
Affinity DataIC50:  10nM. Assay description: Inhibition of platelet-derived growth factor receptor alpha
In DepthDetails ArticlePubMed
TargetVascular endothelial growth factor receptor 2(Homo sapiens (Human))
Kirin Brewery
Curated by ChEMBL
LigandPNGBDBM50162163(1-(3,5-Difluoro-phenyl)-3-[4-(6,7-dimethoxy-quinol...)
Affinity DataIC50:  1.80nM. Assay description: Inhibition of vascular endothelial growth factor receptor 2
In DepthDetails ArticlePubMed