BDBM501625 US11028041, Compound 16
SMILES COC(=O)c1c(O)cc(O)c(Cl)c1CCc1cc(OC)ccc1Cc1ccccc1
InChI Key InChIKey=QBGIDNZJXBCWHG-UHFFFAOYSA-N
Data  2 Kd
  Tab Delimited (TSV)   2D SDfile   Computed 3D by Vconf -m prep SDfile
Find this compound or compounds like it in BindingDB:
Activity Spreadsheet -- Enzyme Inhibition Constant Data from BindingDB
Found 2 hits for monomerid = 501625
TargetHeat shock protein HSP 90-alpha(Homo sapiens (Human))
University Of Kansas
US Patent
LigandPNGBDBM501625(US11028041, Compound 16)
Affinity DataKd:  2.20E+3nM. Assay description: The assay was performed in 96-well black, flat-bottom plates with a final volume of 100 μL. 25 μL of assay buffer (20 mM HEPES, pH 7.3, 50 ...
Ligand InfoPC cidPC sid
In DepthDetails US Patent
TargetEndoplasmin(Canis familiaris)
University Of Kansas
US Patent
LigandPNGBDBM501625(US11028041, Compound 16)
Affinity DataKd:  450nM. Assay description: The assay was performed in 96-well black, flat-bottom plates with a final volume of 100 μL. 25 μL of assay buffer (20 mM HEPES, pH 7.3, 50 ...
Ligand InfoPC cidPC sid
In DepthDetails US Patent