BDBM50162866 Biphenyl-4-carboxylic acid [3-(1,2,4,4a,5,6-hexahydro-pyrazino[1,2-a]quinolin-3-yl)-propyl]-amide::CHEMBL181203
SMILES O=C(NCCCN1CCN2C(CCc3ccccc23)C1)c1ccc(cc1)-c1ccccc1
InChI Key InChIKey=BBOSHAAVWWFNEP-UHFFFAOYSA-N
Data  1 KI
  Tab Delimited (TSV)   2D SDfile   Computed 3D by Vconf -m prep SDfile
Find this compound or compounds like it in BindingDB:
Activity Spreadsheet -- Enzyme Inhibition Constant Data from BindingDB
Found 1 hit for monomerid = 50162866
TargetD(3) dopamine receptor(Rattus norvegicus (Rat))
University Of Michigan
Curated by ChEMBL
LigandPNGBDBM50162866(Biphenyl-4-carboxylic acid [3-(1,2,4,4a,5,6-hexahy...)
Affinity DataKi:  2.52E+3nM. Assay description: Binding affinity D3 [3H]-PD 128907 receptor was determined using caudate-putamen of adult male Spragueo?=Dawley rats
In DepthDetails ArticlePubMed