BDBM50163006 1N-methyl-4-[6-(2-benzyloxy-5-chlorobenzylamino)-2-chloro-9H-9-purinyl]-2,3-dihydroxy-(1S,2R,3S,4R,5S)-bicyclo[3.1.0]hexane-1-carboxamide::CHEMBL434328
SMILES CNC(=O)[C@]12C[C@@H]1[C@H]([C@H](O)[C@@H]2O)n1cnc2c(NCc3cc(Cl)ccc3OCc3ccccc3)nc(Cl)nc12
InChI Key InChIKey=DGZKRHKJMSCQBD-PFBLAMEFSA-N
Data  4 KI
  Tab Delimited (TSV)   2D SDfile   Computed 3D by Vconf -m prep SDfile
Find this compound or compounds like it in BindingDB:
Activity Spreadsheet -- Enzyme Inhibition Constant Data from BindingDB
Found 4 hits for monomerid = 50163006
TargetAdenosine receptor A3(Homo sapiens (Human))
National Institute Of Diabetes And Digestive And Kidney Diseases
Curated by ChEMBL
LigandPNGBDBM50163006(1N-methyl-4-[6-(2-benzyloxy-5-chlorobenzylamino)-2...)
Affinity DataKi:  5.20nM. Assay description: Inhibition of [125I]-AB-MECA binding to human Adenosine A3 receptor expressed in CHO cells
In DepthDetails ArticlePubMed
TargetAdenosine receptor A3(Rattus norvegicus)
National Institute Of Diabetes And Digestive And Kidney Diseases
Curated by ChEMBL
LigandPNGBDBM50163006(1N-methyl-4-[6-(2-benzyloxy-5-chlorobenzylamino)-2...)
Affinity DataKi:  11nM. Assay description: Inhibition of [125I]-AB-MECA binding to rat Adenosine A3 receptor expressed in CHO cells
In DepthDetails ArticlePubMed
TargetAdenosine receptor A2a(Homo sapiens (Human))
National Institute Of Diabetes And Digestive And Kidney Diseases
Curated by ChEMBL
LigandPNGBDBM50163006(1N-methyl-4-[6-(2-benzyloxy-5-chlorobenzylamino)-2...)
Affinity DataKi:  850nM. Assay description: Inhibition of [3H]-CGS- 21680 binding to human Adenosine A2A receptor expressed in CHO cells
In DepthDetails ArticlePubMed
TargetAdenosine receptor A1(Homo sapiens (Human))
National Institute Of Diabetes And Digestive And Kidney Diseases
Curated by ChEMBL
LigandPNGBDBM50163006(1N-methyl-4-[6-(2-benzyloxy-5-chlorobenzylamino)-2...)
Affinity DataKi:  1.20E+3nM. Assay description: Inhibition of [3H]-R-PIA binding to human Adenosine A1 receptor expressed in CHO cells
In DepthDetails ArticlePubMed