BDBM50165209 CHEMBL3798450
SMILES [O-][N+](=O)c1cc(NC(=S)Nc2ccccc2Cl)ccc1Cl
InChI Key InChIKey=IBWBAYYFGFQDBT-UHFFFAOYSA-N
Data  2 KI
  Tab Delimited (TSV)   2D SDfile   Computed 3D by Vconf -m prep SDfile
Find this compound or compounds like it in BindingDB:
Activity Spreadsheet -- Enzyme Inhibition Constant Data from BindingDB
Found 2 hits for monomerid = 50165209
Target5-hydroxytryptamine receptor 2C(Rattus norvegicus (Rat))
Medical University Of Warsaw
Curated by ChEMBL
LigandPNGBDBM50165209(CHEMBL3798450)
Affinity DataKi: >1.00E+4nM. Assay description: Displacement of [3H]mesulergine from 5HT2C receptor in Sprague-Dawley rat brain cortex incubated for 15 mins
In DepthDetails ArticlePubMed
Target5-hydroxytryptamine receptor 2A(Rattus norvegicus (rat))
Medical University Of Warsaw
Curated by ChEMBL
LigandPNGBDBM50165209(CHEMBL3798450)
Affinity DataKi: >1.00E+4nM. Assay description: Displacement of [3H]ketanserin from 5HT2A receptor in Sprague-Dawley rat brain cortex incubated for 15 mins
In DepthDetails ArticlePubMed