BDBM50166010 CHEMBL3797518
SMILES CSc1sc(-c2cc[nH]n2)c2[C@H](Cc3ccccc3)CNC(=O)c12
InChI Key InChIKey=VXWPHMKVTVOQKV-GFCCVEGCSA-N
Data  2 KI
  Tab Delimited (TSV)   2D SDfile   Computed 3D by Vconf -m prep SDfile
Find this compound or compounds like it in BindingDB:
Activity Spreadsheet -- Enzyme Inhibition Constant Data from BindingDB
Found 2 hits for monomerid = 50166010
TargetLeucine-rich repeat serine/threonine-protein kinase 2(Homo sapiens (Human))
Merck Research Laboratories
Curated by ChEMBL
LigandPNGBDBM50166010(CHEMBL3797518)
Affinity DataKi:  159nM. Assay description: Inhibition of human recombinant LRRK2 G2019S mutant using fluorescein- ERM as substrate after 1 hr by TR-FRET assay
In DepthDetails ArticlePubMed
TargetLeucine-rich repeat serine/threonine-protein kinase 2(Homo sapiens (Human))
Merck Research Laboratories
Curated by ChEMBL
LigandPNGBDBM50166010(CHEMBL3797518)
Affinity DataKi:  342nM. Assay description: Inhibition of GST-tagged human recombinant wild type LRRK2 using fluorescein- ERM as substrate after 1 hr by TR-FRET assay
In DepthDetails ArticlePubMed