BDBM50167274 CHEMBL3797399
SMILES Cc1nc2[nH]cnc2cc1-n1c2cn[nH]c2c2cc(F)ccc12
InChI Key InChIKey=BGVWCIRYUNODHW-UHFFFAOYSA-N
Data  2 IC50  1 EC50
  Tab Delimited (TSV)   2D SDfile   Computed 3D by Vconf -m prep SDfile
Find this compound or compounds like it in BindingDB:
Activity Spreadsheet -- Enzyme Inhibition Constant Data from BindingDB
Found 3 hits for monomerid = 50167274
TargetCytochrome P450 1A2(Homo sapiens (Human))
Takeda California
Curated by ChEMBL
LigandPNGBDBM50167274(CHEMBL3797399)
Affinity DataIC50:  3.16E+3nM. Assay description: Inhibition of human CYP1A2 expressed in Escherichia coli DH5alpha
In DepthDetails ArticlePubMed
TargetMicrotubule-associated protein 2(Homo sapiens (Human))
Takeda California
Curated by ChEMBL
LigandPNGBDBM50167274(CHEMBL3797399)
Affinity DataIC50:  5nM. Assay description: Inhibition of recombinant full-length human MetAP2 catalytic domain (110 to 478 residues) expressed in baculovirus using Met-AMC as substrate by fluo...
In DepthDetails ArticlePubMed
TargetMicrotubule-associated protein 2(Homo sapiens (Human))
Takeda California
Curated by ChEMBL
LigandPNGBDBM50167274(CHEMBL3797399)
Affinity DataEC50:  13nM. Assay description: Inhibition of human MetAP2 in HUVEC cells assessed as accumulation of N-Met 14-3-3gamma after 24 hrs by western blot analysis
In DepthDetails ArticlePubMed