BDBM50167870 3-Chloro-4-[4-(5-pyrimidin-2-yl-3,6-dihydro-2H-pyridin-1-yl)-butyl]-4H-benzo[f][1,4]oxazepin-5-one; Compound with fumarate
SMILES ClC1=COc2ccccc2C(=O)N1CCCCN1CCC=C(C1)c1ncccn1
InChI Key InChIKey=ZXHBNZSYVCHQIG-UHFFFAOYSA-N
Data  2 IC50
  Tab Delimited (TSV)   2D SDfile   Computed 3D by Vconf -m prep SDfile
Find this compound or compounds like it in BindingDB:
Activity Spreadsheet -- Enzyme Inhibition Constant Data from BindingDB
Found 2 hits for monomerid = 50167870
TargetD(2) dopamine receptor(Rattus norvegicus (rat))
Daiichi Suntory Biomedical Research
Curated by ChEMBL
LigandPNGBDBM50167870(3-Chloro-4-[4-(5-pyrimidin-2-yl-3,6-dihydro-2H-pyr...)
Affinity DataIC50:  893nM. Assay description: Inhibitory concentration against Dopamine receptor D2 in rat striatum membrane using [3H]raclopride as radioligand
In DepthDetails ArticlePubMed
Target5-hydroxytryptamine receptor 1A(Rattus norvegicus (rat))
Daiichi Suntory Biomedical Research
Curated by ChEMBL
LigandPNGBDBM50167870(3-Chloro-4-[4-(5-pyrimidin-2-yl-3,6-dihydro-2H-pyr...)
Affinity DataIC50:  79.6nM. Assay description: Inhibitory concentration against 5-hydroxytryptamine 1A receptor in rat hippocampus membrane using [3H]-8-OH-DPAT as radioligand
In DepthDetails ArticlePubMed