BDBM50168494 CHEMBL3805001
SMILES NC(=O)c1cncc(OCc2cccc(NC(=O)c3ccc(cc3)-c3ccccc3)c2)c1
InChI Key InChIKey=UAPIELCAVYOYCT-UHFFFAOYSA-N
Data  3 IC50
  Tab Delimited (TSV)   2D SDfile   Computed 3D by Vconf -m prep SDfile
Find this compound or compounds like it in BindingDB:
Activity Spreadsheet -- Enzyme Inhibition Constant Data from BindingDB
Found 3 hits for monomerid = 50168494
TargetNAD-dependent protein deacetylase sirtuin-1(Homo sapiens (Human))
University Of Minnesota
Curated by ChEMBL
LigandPNGBDBM50168494(CHEMBL3805001)
Affinity DataIC50:  1.56E+4nM. Assay description: Inhibition of recombinant human N-terminal His-tagged SIRT1 (1 to 747 residues) expressed in Escherichia coli using Ac-RHK-K(Ac)-AMC as substrate inc...
In DepthDetails ArticlePubMed
TargetNAD-dependent protein deacetylase sirtuin-3, mitochondrial(Homo sapiens (Human))
University Of Minnesota
Curated by ChEMBL
LigandPNGBDBM50168494(CHEMBL3805001)
Affinity DataIC50: >2.00E+5nM. Assay description: Inhibition of human SIRT3 (102 to 399 residues) expressed in Escherichia coli using Ac-RHK-K(Ac)-AMC as substrate incubated for 2 hrs by fluorescence...
In DepthDetails ArticlePubMed
TargetNAD-dependent protein deacetylase sirtuin-2(Homo sapiens (Human))
University Of Minnesota
Curated by ChEMBL
LigandPNGBDBM50168494(CHEMBL3805001)
Affinity DataIC50:  14nM. Assay description: Inhibition of recombinant human C-terminal His-tagged SIRT2 (50 to 389 residues) expressed in Escherichia coli using Ac-RHK-K(Ac)-AMC as substrate in...
In DepthDetails ArticlePubMed