BDBM50168918 CHEMBL3806063
SMILES NC(=O)c1cncc(OCc2cccc(NC(=O)c3cccnc3)c2)c1
InChI Key InChIKey=IVBPXGGEMYKABX-UHFFFAOYSA-N
Data  3 KI  4 IC50
  Tab Delimited (TSV)   2D SDfile   Computed 3D by Vconf -m prep SDfile
Find this compound or compounds like it in BindingDB:
Activity Spreadsheet -- Enzyme Inhibition Constant Data from BindingDB
Found 7 hits for monomerid = 50168918
TargetNAD-dependent protein deacetylase sirtuin-2(Homo sapiens (Human))
University Of Minnesota
Curated by ChEMBL
LigandPNGBDBM50168918(CHEMBL3806063)
Affinity DataKi:  260nM. Assay description: Inhibition of full length human recombinant N-terminal His6-tagged SIRT2 expressed in Escherichia coli BL21(DE3) cells using Ac-RHK-K(Ac)-AMC as subs...
In DepthDetails ArticlePubMed
TargetNAD-dependent protein deacetylase sirtuin-3, mitochondrial(Homo sapiens (Human))
University Of Minnesota
Curated by ChEMBL
LigandPNGBDBM50168918(CHEMBL3806063)
Affinity DataKi:  3.40E+3nM. Assay description: Inhibition of human recombinant SIRT3 expressed in Escherichia coli BL21(DE3) cells using Ac-RHK-K(Ac)-AMC as substrate preincubated for 10 mins foll...
In DepthDetails ArticlePubMed
TargetNAD-dependent protein deacetylase sirtuin-1(Homo sapiens (Human))
University Of Minnesota
Curated by ChEMBL
LigandPNGBDBM50168918(CHEMBL3806063)
Affinity DataKi:  2.00E+4nM. Assay description: Inhibition of human recombinant SIRT1 expressed in Escherichia coli BL21(DE3) cells using Ac-RHK-K(Ac)-AMC as substrate preincubated for 10 mins foll...
In DepthDetails ArticlePubMed
TargetNAD-dependent protein deacetylase sirtuin-2(Homo sapiens (Human))
University Of Minnesota
Curated by ChEMBL
LigandPNGBDBM50168918(CHEMBL3806063)
Affinity DataIC50:  193nM. Assay description: Inhibition of recombinant human C-terminal His-tagged SIRT2 (50 to 389 residues) expressed in Escherichia coli using Ac-RHK-K(Ac)-AMC as substrate in...
In DepthDetails ArticlePubMed
TargetNAD-dependent protein deacetylase sirtuin-1(Homo sapiens (Human))
University Of Minnesota
Curated by ChEMBL
LigandPNGBDBM50168918(CHEMBL3806063)
Affinity DataIC50:  1.87E+4nM. Assay description: Inhibition of recombinant human N-terminal His-tagged SIRT1 (1 to 747 residues) expressed in Escherichia coli using Ac-RHK-K(Ac)-AMC as substrate inc...
In DepthDetails ArticlePubMed
TargetNAD-dependent protein deacetylase sirtuin-3, mitochondrial(Homo sapiens (Human))
University Of Minnesota
Curated by ChEMBL
LigandPNGBDBM50168918(CHEMBL3806063)
Affinity DataIC50:  1.34E+4nM. Assay description: Inhibition of human SIRT3 (102 to 399 residues) expressed in Escherichia coli using Ac-RHK-K(Ac)-AMC as substrate incubated for 2 hrs by fluorescence...
In DepthDetails ArticlePubMed
TargetNAD-dependent protein deacylase sirtuin-5, mitochondrial(Homo sapiens (Human))
University Of Minnesota
Curated by ChEMBL
LigandPNGBDBM50168918(CHEMBL3806063)
Affinity DataIC50: >2.00E+5nM. Assay description: Inhibition of recombinant human N-terminal His-tagged SIRT5 (37 to 310 residues) expressed in Escherichia coli using Ac-Lys(Succ)-AMC as substrate in...
In DepthDetails ArticlePubMed