BDBM501690 4-[2-(Dimethylamino)ethoxy]-2-methyl-6-phenoxy-9H-xanthen-9-one::US11028064, Example 4
SMILES CN(C)CCOc1cc(C)cc2c1oc1cc(Oc3ccccc3)ccc1c2=O
InChI Key InChIKey=FXDMRSZDOHGDRH-UHFFFAOYSA-N
Data  1 IC50
  Tab Delimited (TSV)   2D SDfile   Computed 3D by Vconf -m prep SDfile
Find this compound or compounds like it in BindingDB:
Activity Spreadsheet -- Enzyme Inhibition Constant Data from BindingDB
Found 1 hit for monomerid = 501690
TargetMacrophage colony-stimulating factor 1 receptor(Homo sapiens (Human))
Auckland Uniservices
US Patent
LigandPNGBDBM501690(4-[2-(Dimethylamino)ethoxy]-2-methyl-6-phenoxy-9H-...)
Affinity DataIC50:  550nM. Assay description: IC50 values were determined using the Z′-LYTEŽ activity assay, with ATP concentration used at Km app for the specific assay (500 μM ATP fo...
Ligand InfoPC cidPC sid
In DepthDetails US Patent