BDBM50169851 5,6-Dimethoxy-2-[3-(1-morpholin-4-yl-ethyl)-phenoxy]-indan-1-one::CHEMBL183184
SMILES COc1cc2CC(Oc3cccc(c3)C(C)N3CCOCC3)C(=O)c2cc1OC
InChI Key InChIKey=WBDGFMXZQCHZPG-UHFFFAOYSA-N
Data  1 KI  3 IC50
  Tab Delimited (TSV)   2D SDfile   Computed 3D by Vconf -m prep SDfile
Find this compound or compounds like it in BindingDB:
Activity Spreadsheet -- Enzyme Inhibition Constant Data from BindingDB
Found 4 hits for monomerid = 50169851
TargetAcetylcholinesterase(Homo sapiens (Human))TBA
LigandPNGBDBM50169851(5,6-Dimethoxy-2-[3-(1-morpholin-4-yl-ethyl)-phenox...)
Affinity DataKi:  118nM. Assay description: Binding affinity to acetylcholinesterase (unknown origin)
In DepthDetails Article
TargetAcetylcholinesterase(Rattus norvegicus (rat))TBA
LigandPNGBDBM50169851(5,6-Dimethoxy-2-[3-(1-morpholin-4-yl-ethyl)-phenox...)
Affinity DataIC50:  2.21E+4nM. Assay description: Inhibition of acetylcholinesterase in Rattus norvegicus (rat) cortex by Ellman method
In DepthDetails Article
TargetCarboxylic ester hydrolase(Rattus norvegicus (rat))
Zhejiang University
Curated by ChEMBL
LigandPNGBDBM50169851(5,6-Dimethoxy-2-[3-(1-morpholin-4-yl-ethyl)-phenox...)
Affinity DataIC50:  2.47E+5nM. Assay description: In vitro inhibitory concentration against butyrylcholinesterase was determined using rat serum homogenate
In DepthDetails ArticlePubMed
TargetAcetylcholinesterase(Rattus norvegicus (rat))TBA
LigandPNGBDBM50169851(5,6-Dimethoxy-2-[3-(1-morpholin-4-yl-ethyl)-phenox...)
Affinity DataIC50:  2.21E+4nM. Assay description: In vitro inhibitory concentration against rat cortex acetylcholinesterase
In DepthDetails ArticlePubMed