BDBM50170141 1-Benzyl-7-ethyl-3-propyl-1H,8H-imidazo[2,1-f]purine-2,4-dione::1-benzyl-7-ethyl-3-propyl-1H-imidazo[1,2-a]purine-2,4(3H,8H)-dione::CHEMBL372026
SMILES CCCn1c(=O)n(Cc2ccccc2)c2nc3[nH]c(CC)cn3c2c1=O
InChI Key InChIKey=AQSASUNPGDTELP-UHFFFAOYSA-N
Data  6 KI  2 IC50
  Tab Delimited (TSV)   2D SDfile   Computed 3D by Vconf -m prep SDfile
Find this compound or compounds like it in BindingDB:
Activity Spreadsheet -- Enzyme Inhibition Constant Data from BindingDB
Found 8 hits for monomerid = 50170141
TargetAdenosine receptor A3(Homo sapiens (Human))
Università
Curated by ChEMBL
LigandPNGBDBM50170141(1-Benzyl-7-ethyl-3-propyl-1H,8H-imidazo[2,1-f]puri...)
Affinity DataKi:  15nM. Assay description: Displacement of [3H]MRE3008F20 from human cloned adenosine A3 receptor expressed in CHO cells
In DepthDetails ArticlePubMed
TargetAdenosine receptor A3(Homo sapiens (Human))
Università
Curated by ChEMBL
LigandPNGBDBM50170141(1-Benzyl-7-ethyl-3-propyl-1H,8H-imidazo[2,1-f]puri...)
Affinity DataKi:  15nM. Assay description: Inhibition of [3H]-MRE3008-F20 binding to human adenosine A3 receptor expressed in CHO cells; range is 9 to 27
In DepthDetails ArticlePubMed
TargetAdenosine receptor A2a(Homo sapiens (Human))
Università
Curated by ChEMBL
LigandPNGBDBM50170141(1-Benzyl-7-ethyl-3-propyl-1H,8H-imidazo[2,1-f]puri...)
Affinity DataKi: >1.00E+3nM. Assay description: Displacement of [3H]ZM241385 from human cloned adenosine A2A receptor expressed in CHO cells
In DepthDetails ArticlePubMed
TargetAdenosine receptor A1(Homo sapiens (Human))
Università
Curated by ChEMBL
LigandPNGBDBM50170141(1-Benzyl-7-ethyl-3-propyl-1H,8H-imidazo[2,1-f]puri...)
Affinity DataKi: >1.00E+3nM. Assay description: Inhibition of [3H]-DPCPX binding to human adenosine A1 receptor expressed in CHO cells
In DepthDetails ArticlePubMed
TargetAdenosine receptor A2a(Homo sapiens (Human))
Università
Curated by ChEMBL
LigandPNGBDBM50170141(1-Benzyl-7-ethyl-3-propyl-1H,8H-imidazo[2,1-f]puri...)
Affinity DataKi: >1.00E+3nM. Assay description: Inhibition of [3H]-ZM 241385 binding to human adenosine A2a receptor expressed in CHO cells
In DepthDetails ArticlePubMed
TargetAdenosine receptor A1(Homo sapiens (Human))
Università
Curated by ChEMBL
LigandPNGBDBM50170141(1-Benzyl-7-ethyl-3-propyl-1H,8H-imidazo[2,1-f]puri...)
Affinity DataKi: >1.00E+3nM. Assay description: Displacement of [3H]DPCPX from human cloned adenosine A1 receptor expressed in CHO cells
In DepthDetails ArticlePubMed
TargetAdenosine receptor A2b(Homo sapiens (Human))
Università
Curated by ChEMBL
LigandPNGBDBM50170141(1-Benzyl-7-ethyl-3-propyl-1H,8H-imidazo[2,1-f]puri...)
Affinity DataIC50: >1.00E+3nM. Assay description: Inhibition of 100 nM NECA-stimulated cAMP production in CHO cells expressing human adenosine A2B receptor
In DepthDetails ArticlePubMed
TargetAdenosine receptor A2b(Homo sapiens (Human))
Università
Curated by ChEMBL
LigandPNGBDBM50170141(1-Benzyl-7-ethyl-3-propyl-1H,8H-imidazo[2,1-f]puri...)
Affinity DataIC50: >1.00E+3nM. Assay description: Antagonist activity at human cloned adenosine A2B cells expressed in CHO cells assessed as inhibition of NECA-stimulated cAMP production
In DepthDetails ArticlePubMed