BDBM50170342 2-(2-Methoxy-phenyl)-1-(2-methyl-1-pentyl-1H-indol-3-yl)-ethanone::2-(2-methoxyphenyl)-1-(2-methyl-1-pentyl-1H-indol-3-yl)ethanone::CHEMBL361088::JWH-306
SMILES CCCCCn1c(C)c(C(=O)Cc2ccccc2OC)c2ccccc12
InChI Key InChIKey=HGGHYEFHTTXEIQ-UHFFFAOYSA-N
Data  4 KI
  Tab Delimited (TSV)   2D SDfile   Computed 3D by Vconf -m prep SDfile
Find this compound or compounds like it in BindingDB:
Activity Spreadsheet -- Enzyme Inhibition Constant Data from BindingDB
Found 4 hits for monomerid = 50170342
TargetCannabinoid receptor 1(Rattus norvegicus (rat))
Clemson University
Curated by ChEMBL
LigandPNGBDBM50170342(2-(2-Methoxy-phenyl)-1-(2-methyl-1-pentyl-1H-indol...)
Affinity DataKi:  25nM. Assay description: Binding affinity to displace [3H]CP-55,940 from CB1 receptor of rat brain
In DepthDetails ArticlePubMed
TargetCannabinoid receptor 1(Rattus norvegicus (rat))
Clemson University
Curated by ChEMBL
LigandPNGBDBM50170342(2-(2-Methoxy-phenyl)-1-(2-methyl-1-pentyl-1H-indol...)
Affinity DataKi:  25nM. Assay description: Displacement of [3H]CP-55940 from CB1 receptor in rat brain by filtration assay
In DepthDetails ArticlePubMed
TargetCannabinoid receptor 2(Homo sapiens (Human))
Clemson University
Curated by ChEMBL
LigandPNGBDBM50170342(2-(2-Methoxy-phenyl)-1-(2-methyl-1-pentyl-1H-indol...)
Affinity DataKi:  82nM. Assay description: Binding affinity to displace [3H]CP-55,940 from cloned human CB2 receptor
In DepthDetails ArticlePubMed
TargetCannabinoid receptor 2(Homo sapiens (Human))
Clemson University
Curated by ChEMBL
LigandPNGBDBM50170342(2-(2-Methoxy-phenyl)-1-(2-methyl-1-pentyl-1H-indol...)
Affinity DataKi:  82.0nM. Assay description: Displacement of [3H]CP-55940 from human cloned CB2 receptor by filtration assay
In DepthDetails ArticlePubMed