BDBM50170842 CHEMBL187633::Phosphoric acid monotetradecyl ester
SMILES CCCCCCCCCCCCCCOP(O)(O)=O
InChI Key InChIKey=KRIXEEBVZRZHOS-UHFFFAOYSA-N
Data  2 KI  2 IC50
  Tab Delimited (TSV)   2D SDfile   Computed 3D by Vconf -m prep SDfile
Find this compound or compounds like it in BindingDB:
Activity Spreadsheet -- Enzyme Inhibition Constant Data from BindingDB
Found 4 hits for monomerid = 50170842
TargetLysophosphatidic acid receptor 3(Homo sapiens (Human))
University Of Tennessee Health Science Center
Curated by ChEMBL
LigandPNGBDBM50170842(CHEMBL187633 | Phosphoric acid monotetradecyl este...)
Affinity DataKi:  211nM. Assay description: Binding affinity for Lysophosphatidic acid receptor 3 expressed in RH7777 rat hepatoma cells
In DepthDetails ArticlePubMed
TargetLysophosphatidic acid receptor 1(Homo sapiens (Human))
University Of Tennessee Health Science Center
Curated by ChEMBL
LigandPNGBDBM50170842(CHEMBL187633 | Phosphoric acid monotetradecyl este...)
Affinity DataKi:  1.08E+3nM. Assay description: Binding affinity for Lysophosphatidic acid receptor 1 expressed in RH7777 rat hepatoma cells
In DepthDetails ArticlePubMed
TargetLysophosphatidic acid receptor 3(Homo sapiens (Human))
University Of Tennessee Health Science Center
Curated by ChEMBL
LigandPNGBDBM50170842(CHEMBL187633 | Phosphoric acid monotetradecyl este...)
Affinity DataIC50:  422nM. Assay description: Inhibition of LPA-induced calcium transients in RH7777 rat hepatoma cells expressing LPA3 receptor
In DepthDetails ArticlePubMed
TargetLysophosphatidic acid receptor 1(Homo sapiens (Human))
University Of Tennessee Health Science Center
Curated by ChEMBL
LigandPNGBDBM50170842(CHEMBL187633 | Phosphoric acid monotetradecyl este...)
Affinity DataIC50:  2.30E+3nM. Assay description: Inhibition of LPA-induced calcium transients in RH7777 rat hepatoma cells expressing LPA1 receptor
In DepthDetails ArticlePubMed