BDBM50172116 CHEMBL3809983
SMILES CC(=O)n1cc(N(C(=O)c2cccc(c2)C(F)(F)F)c2cc(O)ccc2C)c2ccccc12
InChI Key InChIKey=GRQZQCNAGDASPY-UHFFFAOYSA-N
Data  1 IC50  1 Kd
PDB links: 1 PDB ID matches this monomer.
  Tab Delimited (TSV)   2D SDfile   Computed 3D by Vconf -m prep SDfile
Find this compound or compounds like it in BindingDB:
Activity Spreadsheet -- Enzyme Inhibition Constant Data from BindingDB
Found 2 hits for monomerid = 50172116
TargetBromodomain adjacent to zinc finger domain protein 2B(Homo sapiens (Human))
University Of Z£Rich
Curated by ChEMBL
LigandPNGBDBM50172116(CHEMBL3809983)
Affinity DataIC50:  2.70E+4nM. Assay description: Competitive binding affinity to His-tagged BRAZ2B (unknown origin) expressed in Escherichia coli BL21(DE3) cells by AlphaScreen assay in presence of ...
TargetBromodomain adjacent to zinc finger domain protein 2B(Homo sapiens (Human))
University Of Z£Rich
Curated by ChEMBL
LigandPNGBDBM50172116(CHEMBL3809983)
Affinity DataKd:  3.90E+4nM. Assay description: Competitive binding affinity to human His-tagged BRAZ2B (1858 to 1972 residues) expressed in T7 phage-infected Escherichia coli BL21(DE3) cells measu...