BDBM50172362 CHEMBL3809477
SMILES CSCC[C@H](NC(=O)[C@H](CS)NC(=O)[C@H](CCCNC(N)=N)NC(=O)[C@H](CCCNC(N)=N)NC(=O)C1CCC(=O)N1)C(=O)N1CCC[C@H]1C(=O)N[C@@H](CC(C)C)C(=O)N[C@@H](Cc1cnc[nH]1)C(=O)N[C@@H](CO)C(=O)N[C@@H](CCCNC(N)=N)C(=O)N[C@@H](C(C)C)C(=O)N1CCC[C@H]1C(=O)N[C@@H](C)C(=O)N1CCC[C@H]1C(O)=O
InChI Key InChIKey=FBDOMMWHVDUYNC-WZVMVPNUSA-N
Data  1 KI  2 EC50
  Tab Delimited (TSV)   2D SDfile   Computed 3D by Vconf -m prep SDfile
Find this compound or compounds like it in BindingDB:
Activity Spreadsheet -- Enzyme Inhibition Constant Data from BindingDB
Found 3 hits for monomerid = 50172362
TargetApelin receptor(Homo sapiens (Human))
Universit£
Curated by ChEMBL
LigandPNGBDBM50172362(CHEMBL3809477)
Affinity DataKi:  49nM. Assay description: Displacement of [125I]-Apelin-13[Glp65, Nle75, Tyr77] from YFP epitope-tagged human APJ expressed in HEK-293 cells after 1 hr by gamma counting metho...
In DepthDetails ArticlePubMed
TargetApelin receptor(Homo sapiens (Human))
Universit£
Curated by ChEMBL
LigandPNGBDBM50172362(CHEMBL3809477)
Affinity DataEC50:  36nM. Assay description: Agonist activity at human APJ receptor expressed in HEK-293 cells assessed as dissociation of G-alpha-i1 protein after 5 mins by BRET assay
In DepthDetails ArticlePubMed
TargetApelin receptor(Homo sapiens (Human))
Universit£
Curated by ChEMBL
LigandPNGBDBM50172362(CHEMBL3809477)
Affinity DataEC50:  3.65E+3nM. Assay description: Agonist activity at human APJ receptor expressed in HEK-293 cells assessed as beta-arrestin2 recruitment after 30 mins by BRET assay
In DepthDetails ArticlePubMed