BDBM50172839 CHEMBL197668::[2-(5-Chloro-2-[1,2,4]triazol-1-yl-benzyl)-benzooxazol-4-yl]-(2,2-difluoro-2-pyridin-2-yl-ethyl)-amine
SMILES FC(F)(CNc1cccc2oc(Cc3cc(Cl)ccc3-n3cncn3)nc12)c1ccccn1
InChI Key InChIKey=IFKMNQOVWBQOFV-UHFFFAOYSA-N
Data  1 KI
  Tab Delimited (TSV)   2D SDfile   Computed 3D by Vconf -m prep SDfile
Find this compound or compounds like it in BindingDB:
Activity Spreadsheet -- Enzyme Inhibition Constant Data from BindingDB
Found 1 hit for monomerid = 50172839
TargetProthrombin(Homo sapiens (Human))
Merck Research Laboratories
Curated by ChEMBL
LigandPNGBDBM50172839(CHEMBL197668 | [2-(5-Chloro-2-[1,2,4]triazol-1-yl-...)
Affinity DataKi:  0.0800nM. Assay description: Inhibitory constant against thrombin
In DepthDetails ArticlePubMed