BDBM50173577 1-{4-Hydroxy-5-[(trityl-amino)-methyl]-tetrahydro-furan-2-yl}-1H-pyrimidine-2,4-dione::CHEMBL372524
SMILES OC1CC(OC1CNC(c1ccccc1)(c1ccccc1)c1ccccc1)n1ccc(=O)[nH]c1=O
InChI Key InChIKey=TUZNCXRMWDUVNX-UHFFFAOYSA-N
Data  3 KI
PDB links: 1 PDB ID matches this monomer.
  Tab Delimited (TSV)   2D SDfile   Computed 3D by Vconf -m prep SDfile
Find this compound or compounds like it in BindingDB:
Activity Spreadsheet -- Enzyme Inhibition Constant Data from BindingDB
Found 3 hits for monomerid = 50173577
TargetDeoxyuridine 5'-triphosphate nucleotidohydrolase(Plasmodium falciparum)
Cardiff University
Curated by ChEMBL
LigandPNGBDBM50173577(1-{4-Hydroxy-5-[(trityl-amino)-methyl]-tetrahydro-...)
Affinity DataKi:  200nM. Assay description: Inhibitory constant against Plasmodium falciparum deoxyuridine 5'-triphosphate nucleotidohydrolase expressed in Escherichia coli BL21 (DE3) cells
TargetDeoxyuridine 5'-triphosphate nucleotidohydrolase, mitochondrial(Homo sapiens (Human))
Cardiff University
Curated by ChEMBL
LigandPNGBDBM50173577(1-{4-Hydroxy-5-[(trityl-amino)-methyl]-tetrahydro-...)
Affinity DataKi:  4.60E+4nM. Assay description: Inhibitory constant against human deoxyuridine 5'-triphosphate nucleotidohydrolase expressed in Escherichia coli BL21 (DE3) cells
In DepthDetails ArticlePubMed
TargetPutative deoxyuridine triphosphatase(Leishmania major)
Cardiff University
Curated by ChEMBL
LigandPNGBDBM50173577(1-{4-Hydroxy-5-[(trityl-amino)-methyl]-tetrahydro-...)
Affinity DataKi:  3.04E+5nM. Assay description: Inhibitory constant against Leishmania major deoxyuridine 5'-triphosphate nucleotidohydrolase
In DepthDetails ArticlePubMed