BDBM50174202 2-benzoylbenzoic acid::CHEMBL196812
SMILES OC(=O)c1ccccc1C(=O)c1ccccc1
InChI Key InChIKey=FGTYTUFKXYPTML-UHFFFAOYSA-N
Data  2 IC50
  Tab Delimited (TSV)   2D SDfile   Computed 3D by Vconf -m prep SDfile
Find this compound or compounds like it in BindingDB:
Activity Spreadsheet -- Enzyme Inhibition Constant Data from BindingDB
Found 2 hits for monomerid = 50174202
TargetAldo-keto reductase family 1 member C3(Homo sapiens (Human))
University Of Ljubljana
Curated by ChEMBL
LigandPNGBDBM50174202(2-benzoylbenzoic acid | CHEMBL196812)
Affinity DataIC50:  7.00E+4nM. Assay description: Inhibition of recombinant human AKR1C3
In DepthDetails ArticlePubMed
TargetMetallo-beta-lactamase VIM-2(Pseudomonas aeruginosa (g-Proteobacteria))
Uit The Arctic University Of Norway
Curated by ChEMBL
LigandPNGBDBM50174202(2-benzoylbenzoic acid | CHEMBL196812)
Affinity DataIC50:  8.00E+3nM. Assay description: Inhibition of Pseudomonas aeruginosa 301-5473 metallo-beta-lactamase VIM-2 expressed in Escherichia coli BL21(DE3) using nitrocefin as substrate prei...
In DepthDetails ArticlePubMed