BDBM50175014 1,5,6-trihydroxy-3-methoxy-4-(2-methylbut-3-en-2-yl)-9H-xanthen-9-one::CHEMBL199304::isocudraniaxanthone B
SMILES COc1cc(O)c2c(oc3c(O)c(O)ccc3c2=O)c1C(C)(C)C=C
InChI Key InChIKey=PELOBHLTYBBGDO-UHFFFAOYSA-N
Data  2 IC50
  Tab Delimited (TSV)   2D SDfile   Computed 3D by Vconf -m prep SDfile
Find this compound or compounds like it in BindingDB:
Activity Spreadsheet -- Enzyme Inhibition Constant Data from BindingDB
Found 2 hits for monomerid = 50175014
TargetSterol O-acyltransferase 2(Homo sapiens (Human))
National Research Laboratory Of Lipid Metabolism And Atherosclerosis
Curated by ChEMBL
LigandPNGBDBM50175014(1,5,6-trihydroxy-3-methoxy-4-(2-methylbut-3-en-2-y...)
Affinity DataIC50:  1.33E+5nM. Assay description: Inhibition of human ACAT2 expressed in Hi5 cells
In DepthDetails ArticlePubMed
TargetSterol O-acyltransferase 1(Homo sapiens (Human))
National Research Laboratory Of Lipid Metabolism And Atherosclerosis
Curated by ChEMBL
LigandPNGBDBM50175014(1,5,6-trihydroxy-3-methoxy-4-(2-methylbut-3-en-2-y...)
Affinity DataIC50:  1.48E+5nM. Assay description: Inhibition of human ACAT1 expressed in Hi5 cells
In DepthDetails ArticlePubMed