BDBM50175015 5,8,10-trihydroxy-3,3-dimethyl-11-(2-methylbut-3-en-2-yl)pyrano[2,3-c]xanthen-7(3H)-one::CHEMBL440392
SMILES CC(C)(C=C)c1c(O)cc(O)c2c1oc1c3C=CC(C)(C)Oc3c(O)cc1c2=O
InChI Key InChIKey=VDIZUJPZYMJMRS-UHFFFAOYSA-N
Data  2 IC50
  Tab Delimited (TSV)   2D SDfile   Computed 3D by Vconf -m prep SDfile
Find this compound or compounds like it in BindingDB:
Activity Spreadsheet -- Enzyme Inhibition Constant Data from BindingDB
Found 2 hits for monomerid = 50175015
TargetSterol O-acyltransferase 2(Homo sapiens (Human))
National Research Laboratory Of Lipid Metabolism And Atherosclerosis
Curated by ChEMBL
LigandPNGBDBM50175015(5,8,10-trihydroxy-3,3-dimethyl-11-(2-methylbut-3-e...)
Affinity DataIC50:  2.88E+4nM. Assay description: Inhibition of human ACAT2 expressed in Hi5 cells
In DepthDetails ArticlePubMed
TargetSterol O-acyltransferase 1(Homo sapiens (Human))
National Research Laboratory Of Lipid Metabolism And Atherosclerosis
Curated by ChEMBL
LigandPNGBDBM50175015(5,8,10-trihydroxy-3,3-dimethyl-11-(2-methylbut-3-e...)
Affinity DataIC50:  4.00E+4nM. Assay description: Inhibition of human ACAT1 expressed in Hi5 cells
In DepthDetails ArticlePubMed