BDBM50175789 1-(4,4-bis(3-((naphthalen-1-yloxy)methyl)thiophen-2-yl)but-3-enyl)piperidine-2-carboxylic acid hydrochloride::CHEMBL558000
SMILES [#8]-[#6](=O)-[#6]-1-[#6]-[#6]-[#6]-[#6]-[#7]-1-[#6]-[#6]\[#6]=[#6](\c1sccc1-[#6]-[#8]-c1cccc2ccccc12)-c1sccc1-[#6]-[#8]-c1cccc2ccccc12
InChI Key InChIKey=VZXUYQIMQRZAFU-UHFFFAOYSA-N
Data  1 IC50
  Tab Delimited (TSV)   2D SDfile   Computed 3D by Vconf -m prep SDfile
Find this compound or compounds like it in BindingDB:
Activity Spreadsheet -- Enzyme Inhibition Constant Data from BindingDB
Found 1 hit for monomerid = 50175789
TargetSodium- and chloride-dependent GABA transporter 1(Homo sapiens (Human))
Fudan University
Curated by ChEMBL
LigandPNGBDBM50175789(1-(4,4-bis(3-((naphthalen-1-yloxy)methyl)thiophen-...)
Affinity DataIC50: >1.00E+5nM. Assay description: Inhibition of GAT1 transport activity
In DepthDetails ArticlePubMed